Target
E3 SUMO-protein ligase CBX4
Ligand
BDBM50194476
Substrate
Meas. Tech.
ChEMBL_1616630 (CHEMBL3858699)
IC50
140±n/a nM
Citation
 Stuckey, JISimpson, CNorris-Drouin, JLCholensky, SHLee, JPasca, RCheng, NDickson, BMPearce, KHFrye, SVJames, LI Structure-Activity Relationships and Kinetic Studies of Peptidic Antagonists of CBX Chromodomains. J Med Chem 59:8913-8923 (2016)  
Target
Name:
E3 SUMO-protein ligase CBX4
Synonyms:
6.3.2.- CBX4_HUMAN Pc2 hPc2
Type:
PROTEIN
Mol. Mass.:
61401.05
Organism:
Homo sapiens (Human)
Description:
ChEMBL_108273
Residue:
560
  
Inhibitor
Name:
BDBM50194476
Synonyms:
CHEMBL3942693
Type:
Small organic molecule
Emp. Form.:
C44H69N7O7
Mol. Mass.:
808.0614
SMILES:
CCN(CC)CCCC[C@H](NC(=O)[C@H](CC(C)C)NC(=O)[C@H](C)NC(=O)[C@H](Cc1ccccc1)NC(=O)c1ccc(cc1)C(C)(C)C)C(=O)N[C@@H](CO)C(=O)N(C)C
: