Target
Chromobox protein homolog 8
Ligand
BDBM50194459
Substrate
Meas. Tech.
ChEMBL_1616629 (CHEMBL3858698)
IC50
>60000±n/a nM
Citation
 Stuckey, JISimpson, CNorris-Drouin, JLCholensky, SHLee, JPasca, RCheng, NDickson, BMPearce, KHFrye, SVJames, LI Structure-Activity Relationships and Kinetic Studies of Peptidic Antagonists of CBX Chromodomains. J Med Chem 59:8913-8923 (2016)  
Target
Name:
Chromobox protein homolog 8
Synonyms:
CBX8 PC3 RC1 hPc3
Type:
PROTEIN
Mol. Mass.:
43415.86
Organism:
Homo sapiens (Human)
Description:
ChEMBL_108272
Residue:
389
  
Inhibitor
Name:
BDBM50194459
Synonyms:
CHEMBL3916833
Type:
Small organic molecule
Emp. Form.:
C37H53N7O9
Mol. Mass.:
739.8582
SMILES:
COC(=O)[C@H](CO)NC(=O)[C@H](CCCCN)NC(=O)[C@H](CC(C)C)NC(=O)[C@H](C)NC(=O)[C@H](Cc1ccccc1)NC(=O)CNC(=O)c1ccccc1
: