Target
Chromodomain Y-like protein 2
Ligand
BDBM50194462
Substrate
Meas. Tech.
ChEMBL_1616627 (CHEMBL3858696)
IC50
500±n/a nM
Citation
 Stuckey, JISimpson, CNorris-Drouin, JLCholensky, SHLee, JPasca, RCheng, NDickson, BMPearce, KHFrye, SVJames, LI Structure-Activity Relationships and Kinetic Studies of Peptidic Antagonists of CBX Chromodomains. J Med Chem 59:8913-8923 (2016)  
Target
Name:
Chromodomain Y-like protein 2
Synonyms:
CDY-like 2 CDYL2_HUMAN | Chromodomain Y-like protein 2
Type:
PROTEIN
Mol. Mass.:
56517.92
Organism:
Homo sapiens (Human)
Description:
ChEMBL_116982
Residue:
506
  
Inhibitor
Name:
BDBM50194462
Synonyms:
CHEMBL3898460
Type:
Small organic molecule
Emp. Form.:
C44H68N6O8
Mol. Mass.:
809.0461
SMILES:
CC[C@H](NC(=O)[C@H](Cc1ccccc1)NC(=O)c1ccc(cc1)C(C)(C)C)C(=O)N[C@@H](CC(C)C)C(=O)N[C@@H](CCCCN(CC)CC)C(=O)N[C@@H](CO)C(=O)OC
: