Target
Histone-lysine N-methyltransferase 2A/Retinoblastoma-binding protein 5/Set1/Ash2 histone methyltransferase complex subunit ASH2/WD repeat-containing protein 5
Ligand
BDBM50195362
Substrate
Meas. Tech.
ChEMBL_1617718 (CHEMBL3859787)
IC50
4600±n/a nM
Citation
 Li, DDWang, ZHChen, WLXie, YYYou, QDGuo, XK Structure-based design of ester compounds to inhibit MLL complex catalytic activity by targeting mixed lineage leukemia 1 (MLL1)-WDR5 interaction. Bioorg Med Chem 24:6109-6118 (2016)  
Target
Name:
Histone-lysine N-methyltransferase 2A/Retinoblastoma-binding protein 5/Set1/Ash2 histone methyltransferase complex subunit ASH2/WD repeat-containing protein 5
Synonyms:
MLL | MLL1/ASH2L/RBBP5/WDR5 complex
Type:
Protein
Mol. Mass.:
Description:
Components:
This complex has 4 components.
Component 1
Name:
Histone-lysine N-methyltransferase 2A
Synonyms:
ALL-1 ALL1 CXXC-type zinc finger protein 7 HRX Histone-lysine N-methyltransferase 2A KMT2A_HUMAN MLL MLL cleavage product N320 Myeloid/lymphoid or mixed-lineage leukemia Myeloid/lymphoid or mixed-lineage leukemia protein 1 TRX1 Zinc finger protein HRX p320
Type:
Protein
Mol. Mass.:
431905.67
Organism:
Homo sapiens (Human)
Description:
Q03164
Residue:
3969
  
Component 2
Name:
WD repeat-containing protein 5
Synonyms:
BIG3 WD repeat-containing protein 5 (WDR5) WDR5 | WDR5_HUMAN
Type:
Protein
Mol. Mass.:
36597.13
Organism:
Homo sapiens (Human)
Description:
P61964
Residue:
334
  
Component 3
Name:
Retinoblastoma-binding protein 5
Synonyms:
RBBP5 RBQ3 | Retinoblastoma-binding protein 5 (RBBP5)
Type:
Protein
Mol. Mass.:
59133.29
Organism:
Homo sapiens (Human)
Description:
Q15291
Residue:
538
  
Component 4
Name:
Set1/Ash2 histone methyltransferase complex subunit ASH2
Synonyms:
ASH2L ASH2L_HUMAN | Ash2-like protein (ASH2L)
Type:
Protein
Mol. Mass.:
68712.48
Organism:
Homo sapiens (Human)
Description:
Q9UBL3
Residue:
628
  
Inhibitor
Name:
BDBM50195362
Synonyms:
CHEMBL3907289
Type:
Small organic molecule
Emp. Form.:
C21H24ClFN4O3
Mol. Mass.:
434.892
SMILES:
COC(=O)c1ccc(N2CCN(C)CC2)c(NC(=O)c2cc(N)c(F)c(C)c2Cl)c1
: