Target
5'-AMP-activated protein kinase catalytic subunit alpha-1/subunit beta-2/subunit gamma-1
Ligand
BDBM50195534
Substrate
Meas. Tech.
ChEMBL_1617804 (CHEMBL3859873)
EC50
4.0±n/a nM
Citation
 Cameron, KOKurumbail, RG Recent progress in the identification of adenosine monophosphate-activated protein kinase (AMPK) activators. Bioorg Med Chem Lett 26:5139-5148 (2016)  
Target
Name:
5'-AMP-activated protein kinase catalytic subunit alpha-1/subunit beta-2/subunit gamma-1
Synonyms:
AMPK alpha1/beta2/gamma1
Type:
Mol. Mass.:
Description:
ASSAY_ID of ChEMBL is 1576586
Components:
This complex has 3 components.
Component 1
Name:
5'-AMP-activated protein kinase subunit beta-2
Synonyms:
AAKB2_HUMAN AMPK subunit beta-2 | PRKAB2
Type:
PROTEIN
Mol. Mass.:
30301.35
Organism:
Homo sapiens (Human)
Description:
ChEMBL_107883
Residue:
272
  
Component 2
Name:
5'-AMP-activated protein kinase subunit gamma-1
Synonyms:
5'-AMP-activated protein kinase subunit gamma-1 AMP-activated protein kinase, gamma-1 subunit AMPK gamma-1 AMPK subunit gamma-1 PRKAG1
Type:
Mol. Mass.:
37581.44
Organism:
Homo sapiens (Human)
Description:
P54619
Residue:
331
  
Component 3
Name:
5'-AMP-activated protein kinase catalytic subunit alpha-1
Synonyms:
AAPK1_HUMAN AMP-activated protein kinase alpha-1/beta-2/gamma-2 AMPK subunit alpha-1 AMPK1 PRKAA1 | Tau-protein kinase PRKAA1
Type:
Protein
Mol. Mass.:
64023.62
Organism:
Homo sapiens (Human)
Description:
Q13131
Residue:
559
  
Inhibitor
Name:
BDBM50195534
Synonyms:
CHEMBL3957286
Type:
Small organic molecule
Emp. Form.:
C25H21ClN2O6
Mol. Mass.:
480.897
SMILES:
[H][C@]12OC[C@@H](Oc3nc4cc(c(Cl)cc4[nH]3)-c3ccc(cc3)-c3c(O)cccc3O)[C@@]1([H])OC[C@H]2O
: