Target
Lysophosphatidic acid receptor 1
Ligand
BDBM50195695
Substrate
Meas. Tech.
ChEMBL_1617900 (CHEMBL3859969)
IC50
160±n/a nM
Citation
 Terakado, MSuzuki, HHashimura, KTanaka, MUeda, HKohno, HFujimoto, TSaga, HNakade, SHabashita, HTakaoka, YSeko, T Discovery of ONO-7300243 from a Novel Class of Lysophosphatidic Acid Receptor 1 Antagonists: From Hit to Lead. ACS Med Chem Lett 7:913-918 (2016)  
Target
Name:
Lysophosphatidic acid receptor 1
Synonyms:
EDG2 LPA-1 LPAR1 Lysophosphatidic acid receptor 1 (LPA1) | Lysophosphatidic acid receptor Edg-2
Type:
Enzyme
Mol. Mass.:
41120.55
Organism:
Homo sapiens (Human)
Description:
Q92633
Residue:
364
  
Inhibitor
Name:
BDBM50195695
Synonyms:
CHEMBL3941037
Type:
Small organic molecule
Emp. Form.:
C28H31NO5
Mol. Mass.:
461.5494
SMILES:
COc1cc(cc(OC)c1C)C(=O)N(CCCc1ccccc1)Cc1ccc(CC(O)=O)cc1
: