Target
Beta-lactamase
Ligand
BDBM197302
Substrate
Meas. Tech.
ChEMBL_1617950 (CHEMBL3860119)
IC50
>2000000±n/a nM
Citation
 Lund, BAChristopeit, TGuttormsen, YBayer, ALeiros, HK Screening and Design of Inhibitor Scaffolds for the Antibiotic Resistance Oxacillinase-48 (OXA-48) through Surface Plasmon Resonance Screening. J Med Chem 59:5542-54 (2016)  
Target
Name:
Beta-lactamase
Synonyms:
Beta-lactamase Synonyms=blaOXA-48 | bla
Type:
PROTEIN
Mol. Mass.:
30363.94
Organism:
Klebsiella pneumoniae
Description:
ChEMBL_103606
Residue:
265
  
Inhibitor
Name:
BDBM197302
Synonyms:
Benzoic acid | SAMPL4, O1
Type:
Small organic molecule
Emp. Form.:
C7H6O2
Mol. Mass.:
122.1213
SMILES:
OC(=O)c1ccccc1
: