Target
Beta-lactamase
Ligand
BDBM50195795
Substrate
Meas. Tech.
ChEMBL_1617949 (CHEMBL3860118)
Kd
330000±n/a nM
Citation
 Lund, BAChristopeit, TGuttormsen, YBayer, ALeiros, HK Screening and Design of Inhibitor Scaffolds for the Antibiotic Resistance Oxacillinase-48 (OXA-48) through Surface Plasmon Resonance Screening. J Med Chem 59:5542-54 (2016)  
Target
Name:
Beta-lactamase
Synonyms:
Beta-lactamase Synonyms=blaOXA-48 | bla
Type:
PROTEIN
Mol. Mass.:
30363.94
Organism:
Klebsiella pneumoniae
Description:
ChEMBL_103606
Residue:
265
  
Inhibitor
Name:
BDBM50195795
Synonyms:
CHEMBL3908259
Type:
Small organic molecule
Emp. Form.:
C12H10N2O2
Mol. Mass.:
214.22
SMILES:
Nc1cccnc1-c1cccc(c1)C(O)=O
: