Target
Sortase family protein
Ligand
BDBM50196059
Substrate
Meas. Tech.
ChEMBL_1618140 (CHEMBL3860309)
Ki
11100±n/a nM
Citation
 Rentero Rebollo, IMcCallin, SBertoldo, DEntenza, JMMoreillon, PHeinis, C Development of Potent and Selective S. aureus Sortase A Inhibitors Based on Peptide Macrocycles. ACS Med Chem Lett 7:606-11 (2016)  
Target
Name:
Sortase family protein
Synonyms:
Sortase | Sortase A (SrtA)
Type:
Enzyme
Mol. Mass.:
23546.15
Organism:
Staphylococcus aureus
Description:
Residue:
206
  
Inhibitor
Name:
BDBM50196059
Synonyms:
CHEMBL3941715
Type:
Small organic molecule
Emp. Form.:
C67H101N17O17S3
Mol. Mass.:
1512.818
SMILES:
[H][C@@]12CCCN1C(=O)[C@]1([H])CCCN1C(=O)[C@@H](CC(N)=O)NC(=O)[C@@H]1CSCc3cc(CSC[C@H](NC(=O)[C@H](C)N)C(=O)N[C@@H](CO)C(=O)N[C@@]([H])([C@@H](C)CC)C(=O)N[C@@H](CC(C)C)C(=O)N4CCC[C@@]4([H])C(=O)N4CCC[C@@]4([H])C(=O)N1)cc(CSC[C@H](NC(=O)[C@H](CCC(N)=O)NC2=O)C(=O)NCC(N)=O)c3
: