Target
Smoothened homolog
Ligand
BDBM50196084
Substrate
Meas. Tech.
ChEMBL_1618171 (CHEMBL3860340)
EC50
700±n/a nM
Citation
 Manetti, FPetricci, EGabrielli, AMann, AFaure, HGorojankina, TBrasseur, LHoch, LRuat, MTaddei, M Design, synthesis and biological characterization of a new class of osteogenic (1H)-quinolone derivatives. Eur J Med Chem 121:747-757 (2016)  
Target
Name:
Smoothened homolog
Synonyms:
SMO_MOUSE Smoh
Type:
PROTEIN
Mol. Mass.:
87472.73
Organism:
Mus musculus
Description:
ChEMBL_1510377
Residue:
793
  
Inhibitor
Name:
BDBM50196084
Synonyms:
CHEMBL3970506
Type:
Small organic molecule
Emp. Form.:
C25H28N2O5
Mol. Mass.:
436.5002
SMILES:
CCCCCn1c2ccccc2c(O)c(C(=O)Nc2ccc(cc2)C(=O)OCCC)c1=O
: