Target
Smoothened homolog
Ligand
BDBM50196086
Substrate
Meas. Tech.
ChEMBL_1618171 (CHEMBL3860340)
EC50
2000±n/a nM
Citation
 Manetti, FPetricci, EGabrielli, AMann, AFaure, HGorojankina, TBrasseur, LHoch, LRuat, MTaddei, M Design, synthesis and biological characterization of a new class of osteogenic (1H)-quinolone derivatives. Eur J Med Chem 121:747-757 (2016)  
Target
Name:
Smoothened homolog
Synonyms:
SMO_MOUSE Smoh
Type:
PROTEIN
Mol. Mass.:
87472.73
Organism:
Mus musculus
Description:
ChEMBL_1510377
Residue:
793
  
Inhibitor
Name:
BDBM50196086
Synonyms:
CHEMBL3974265
Type:
Small organic molecule
Emp. Form.:
C30H30N2O5
Mol. Mass.:
498.5696
SMILES:
CCCCCCn1c2ccccc2c(O)c(C(=O)Nc2ccc(cc2)C(=O)OCc2ccccc2)c1=O
: