Target
Dihydrofolate reductase
Ligand
BDBM50196301
Substrate
Meas. Tech.
ChEBML_1618320
IC50
800±n/a nM
Citation
 El-Messery, SMHassan, GSNagi, MNHabib, EEAl-Rashood, STEl-Subbagh, HI Synthesis, biological evaluation and molecular modeling study of some new methoxylated 2-benzylthio-quinazoline-4(3H)-ones as nonclassical antifolates. Bioorg Med Chem Lett 26:4815-4823 (2016)  
Target
Name:
Dihydrofolate reductase
Synonyms:
DHFR Dihydrofolate reductase | Dihydrofolate reductase (DHFR)
Type:
Enzyme
Mol. Mass.:
21603.71
Organism:
Bos taurus (Cattle)
Description:
P00376
Residue:
187
  
Inhibitor
Name:
BDBM50196301
Synonyms:
CHEMBL3919828
Type:
Small organic molecule
Emp. Form.:
C27H28N2O7S
Mol. Mass.:
524.585
SMILES:
COc1cc(CSc2nc3cc(OC)c(OC)cc3c(=O)n2-c2ccccc2OC)cc(OC)c1OC
: