Target
Dihydrofolate reductase
Ligand
BDBM50196317
Substrate
Meas. Tech.
ChEMBL_1618320 (CHEMBL3860489)
IC50
2000±n/a nM
Citation
 El-Messery, SMHassan, GSNagi, MNHabib, EEAl-Rashood, STEl-Subbagh, HI Synthesis, biological evaluation and molecular modeling study of some new methoxylated 2-benzylthio-quinazoline-4(3H)-ones as nonclassical antifolates. Bioorg Med Chem Lett 26:4815-4823 (2016)  
Target
Name:
Dihydrofolate reductase
Synonyms:
DHFR Dihydrofolate reductase | Dihydrofolate reductase (DHFR)
Type:
Enzyme
Mol. Mass.:
21603.71
Organism:
Bos taurus (Cattle)
Description:
P00376
Residue:
187
  
Inhibitor
Name:
BDBM50196317
Synonyms:
CHEMBL3955772
Type:
Small organic molecule
Emp. Form.:
C25H24N2O4S
Mol. Mass.:
448.534
SMILES:
COc1ccc(CSc2nc3cc(OC)c(OC)cc3c(=O)n2-c2ccc(C)cc2)cc1
: