Target
Proto-oncogene tyrosine-protein kinase Src
Ligand
BDBM50196899
Substrate
Meas. Tech.
ChEMBL_1618939 (CHEMBL3861108)
IC50
75000±n/a nM
Citation
 Wang, YDBao, XQXu, SYu, WWCao, SNHu, JPLi, YWang, XLZhang, DYu, SS A Novel Parkinson's Disease Drug Candidate with Potent Anti-neuroinflammatory Effects through the Src Signaling Pathway. J Med Chem 59:9062-9079 (2016)  
Target
Name:
Proto-oncogene tyrosine-protein kinase Src
Synonyms:
Neuronal proto-oncogene tyrosine-protein kinase Src SRC_MOUSE Tyrosine-protein kinase SRC
Type:
Protein
Mol. Mass.:
60650.57
Organism:
Mus musculus (Mouse)
Description:
P05480
Residue:
541
  
Inhibitor
Name:
BDBM50196899
Synonyms:
CHEMBL3920958
Type:
Small organic molecule
Emp. Form.:
C20H34ClNO5
Mol. Mass.:
403.941
SMILES:
Cl.COc1cc(OC)c(C(=O)CC(C)C)c(OCC(O)CNC(C)(C)C)c1
: