Target
Glycogen phosphorylase, muscle form
Ligand
BDBM50295860
Substrate
Meas. Tech.
ChEMBL_1619017 (CHEMBL3861186)
Ki
229000±n/a nM
Citation
 Galal, SAKhattab, MAndreadaki, FChrysina, EDPraly, JPRagab, FAFEl Diwani, HI Synthesis of (benzimidazol-2-yl)aniline derivatives as glycogen phosphorylase inhibitors. Bioorg Med Chem 24:5423-5430 (2016)  
Target
Name:
Glycogen phosphorylase, muscle form
Synonyms:
Glycogen Phosphorylase (PYGM) Glycogen phosphorylase, muscle form PYGM | PYGM_RABIT
Type:
Enzyme
Mol. Mass.:
97296.32
Organism:
Oryctolagus cuniculus (rabbit)
Description:
Phosphorylation of Ser-15 converts phosphorylase B (unphosphorylated) to phosphorylase A.
Residue:
843
  
Inhibitor
Name:
BDBM50295860
Synonyms:
(2R,3R,4S,5S,6R)-2-(benzo[d]thiazol-2-yl)-6-(hydroxymethyl)tetrahydro-2H-pyran-3,4,5-triol | CHEMBL559793
Type:
Small organic molecule
Emp. Form.:
C13H15NO5S
Mol. Mass.:
297.327
SMILES:
OC[C@H]1O[C@H]([C@H](O)[C@@H](O)[C@@H]1O)c1nc2ccccc2s1
: