Target
Glycogen phosphorylase, liver form
Ligand
BDBM50196903
Substrate
Meas. Tech.
ChEMBL_1619019 (CHEMBL3861188)
IC50
200±n/a nM
Citation
 Galal, SAKhattab, MAndreadaki, FChrysina, EDPraly, JPRagab, FAFEl Diwani, HI Synthesis of (benzimidazol-2-yl)aniline derivatives as glycogen phosphorylase inhibitors. Bioorg Med Chem 24:5423-5430 (2016)  
Target
Name:
Glycogen phosphorylase, liver form
Synonyms:
Glycogen Phosphorylase (PYGL) Liver glycogen phosphorylase PYGL_HUMAN
Type:
Homodimer
Mol. Mass.:
97153.98
Organism:
Homo sapiens (Human)
Description:
Dimers associate into a tetramer to form the enzymatically active phosphorylase A.
Residue:
847
  
Inhibitor
Name:
BDBM50196903
Synonyms:
CHEMBL3916767
Type:
Small organic molecule
Emp. Form.:
C24H23ClFN3O4
Mol. Mass.:
471.909
SMILES:
OC1CCN(CC1)C(=O)C(=O)[C@H](Cc1ccc(F)cc1)NC(=O)c1cc2cc(Cl)ccc2[nH]1
: