Target
Excitatory amino acid transporter 3
Ligand
BDBM50197041
Substrate
Meas. Tech.
ChEMBL_1619057 (CHEMBL3861226)
IC50
3000±n/a nM
Citation
 Hansen, JCBjørn-Yoshimoto, WEBisballe, NNielsen, BJensen, AABunch, L ß-Sulfonamido Functionalized Aspartate Analogues as Excitatory Amino Acid Transporter Inhibitors: Distinct Subtype Selectivity Profiles Arising from Subtle Structural Differences. J Med Chem 59:8771-8786 (2016)  
Target
Name:
Excitatory amino acid transporter 3
Synonyms:
EAA3_HUMAN EAAT3 HEAAC1 | SLC1A1
Type:
Enzyme Catalytic Domain
Mol. Mass.:
57096.71
Organism:
Homo sapiens (Human)
Description:
Excitatory Amino Acid EAAT3 0 HUMAN::P43005
Residue:
524
  
Inhibitor
Name:
BDBM50197041
Synonyms:
CHEMBL3948303
Type:
Small organic molecule
Emp. Form.:
C10H13N3O6S
Mol. Mass.:
303.292
SMILES:
N[C@@H](C(NS(=O)(=O)c1ccc(N)cc1)C(O)=O)C(O)=O
: