Target
Potassium channel subfamily K member 18
Ligand
BDBM50197058
Substrate
Meas. Tech.
ChEBML_1619071
EC50
45000±n/a nM
Citation
 Monteillier, ALoucif, AOmoto, KStevens, EBLainez, SSaintot, PPCao, LPryde, DC Investigation of the structure activity relationship of flufenamic acid derivatives at the human TRESK channel K Bioorg Med Chem Lett 26:4919-4924 (2016)  
Target
Name:
Potassium channel subfamily K member 18
Synonyms:
KCNK18 Potassium channel subfamily K member 18 TRIK TWIK-related spinal cord potassium channel
Type:
PROTEIN
Mol. Mass.:
43672.81
Organism:
Homo sapiens (Human)
Description:
ChEMBL_105638
Residue:
384
  
Inhibitor
Name:
BDBM50197058
Synonyms:
CHEMBL3970106
Type:
Small organic molecule
Emp. Form.:
C17H19NO2
Mol. Mass.:
269.3383
SMILES:
CC(C)(C)c1cccc(Nc2ccccc2C(O)=O)c1
: