Target
Phosphatidylinositol 4-phosphate 3-kinase C2 domain-containing subunit alpha
Ligand
BDBM81368
Substrate
Meas. Tech.
ChEMBL_1619091 (CHEMBL3861260)
IC50
47±n/a nM
Citation
 Falasca, MHamilton, JRSelvadurai, MSundaram, KAdamska, AThompson, PE Class II Phosphoinositide 3-Kinases as Novel Drug Targets. J Med Chem 60:47-65 (2017)  
Target
Name:
Phosphatidylinositol 4-phosphate 3-kinase C2 domain-containing subunit alpha
Synonyms:
P3C2A_HUMAN PIK3C2A Phosphatidylinositol-4-phosphate 3-kinase C2 domain-containing subunit alpha PtdIns-3-kinase C2 subunit alpha
Type:
Protein
Mol. Mass.:
190704.50
Organism:
Homo sapiens (Human)
Description:
O00443
Residue:
1686
  
Inhibitor
Name:
BDBM81368
Synonyms:
PIK90
Type:
Small organic molecule
Emp. Form.:
C18H17N5O3
Mol. Mass.:
351.3593
SMILES:
COc1ccc2C3=NCCN3C(NC(=O)c3cccnc3)=Nc2c1OC
: