Target
DNA-dependent protein kinase catalytic subunit
Ligand
BDBM50197062
Substrate
Meas. Tech.
ChEMBL_1619107 (CHEMBL3861276)
IC50
4800±n/a nM
Citation
 Falasca, MHamilton, JRSelvadurai, MSundaram, KAdamska, AThompson, PE Class II Phosphoinositide 3-Kinases as Novel Drug Targets. J Med Chem 60:47-65 (2017)  
Target
Name:
DNA-dependent protein kinase catalytic subunit
Synonyms:
DNA-PK catalytic subunit DNA-dependent protein kinase (DNA-PK) DNA-dependent protein kinase catalytic subunit (DNA-PK) HYRC PRKDC | PRKDC_HUMAN
Type:
Protein
Mol. Mass.:
469114.78
Organism:
Homo sapiens (Human)
Description:
P78527
Residue:
4128
  
Inhibitor
Name:
BDBM50197062
Synonyms:
Pilaralisib XL-147
Type:
Small organic molecule
Emp. Form.:
C25H25ClN6O4S
Mol. Mass.:
541.022
SMILES:
COc1ccc(Cl)c(Nc2nc3ccccc3nc2NS(=O)(=O)c2cccc(NC(=O)C(C)(C)N)c2)c1
: