Target
Leukotriene A-4 hydrolase
Ligand
BDBM50197084
Substrate
Meas. Tech.
ChEMBL_1619177 (CHEMBL3861346)
Ki
360±n/a nM
Citation
 Wittmann, SKKalinowsky, LKramer, JSBloecher, RKnapp, SSteinhilber, DPogoryelov, DProschak, EHeering, J Thermodynamic properties of leukotriene A Bioorg Med Chem 24:5243-5248 (2016)  
Target
Name:
Leukotriene A-4 hydrolase
Synonyms:
LKHA4_HUMAN LTA4 Leukotriene A(4) hydrolase Leukotriene A4 hydrolase
Type:
Hydrolase; metalloprotease
Mol. Mass.:
69280.41
Organism:
Homo sapiens (Human)
Description:
Human recombinant LTA4H.
Residue:
611
  
Inhibitor
Name:
BDBM50197084
Synonyms:
CHEMBL3883608
Type:
Small organic molecule
Emp. Form.:
C16H14N2S
Mol. Mass.:
266.361
SMILES:
Nc1nc(cs1)-c1ccc(Cc2ccccc2)cc1
: