Target
Leukotriene A-4 hydrolase
Ligand
BDBM23971
Substrate
Meas. Tech.
ChEMBL_1619180 (CHEMBL3861349)
Kd
4630±n/a nM
Citation
 Wittmann, SKKalinowsky, LKramer, JSBloecher, RKnapp, SSteinhilber, DPogoryelov, DProschak, EHeering, J Thermodynamic properties of leukotriene A Bioorg Med Chem 24:5243-5248 (2016)  
Target
Name:
Leukotriene A-4 hydrolase
Synonyms:
LKHA4_HUMAN LTA4 Leukotriene A(4) hydrolase Leukotriene A4 hydrolase
Type:
Hydrolase; metalloprotease
Mol. Mass.:
69280.41
Organism:
Homo sapiens (Human)
Description:
Human recombinant LTA4H.
Residue:
611
  
Inhibitor
Name:
BDBM23971
Synonyms:
(2S)-2-[(2S,3R)-3-amino-2-hydroxy-4-phenylbutanamido]-4-methylpentanoic acid CHEMBL29292 | Ubenimex
Type:
Small organic molecule
Emp. Form.:
C16H24N2O4
Mol. Mass.:
308.3728
SMILES:
CC(C)C[C@H](NC(=O)[C@@H](O)[C@H](N)Cc1ccccc1)C(O)=O
: