Target
Cytochrome P450 2C9
Ligand
BDBM50197091
Substrate
Meas. Tech.
ChEMBL_1619194 (CHEMBL3861363)
IC50
>50000±n/a nM
Citation
 Kühne, HObst-Sander, UKuhn, BConte, ACeccarelli, SMNeidhart, WRudolph, MGOttaviani, GGasser, RSo, SSLi, SZhang, XGao, LMyers, M Design and synthesis of selective, dual fatty acid binding protein 4 and 5 inhibitors. Bioorg Med Chem Lett 26:5092-5097 (2016)  
Target
Name:
Cytochrome P450 2C9
Synonyms:
(R)-limonene 6-monooxygenase CP2C9_HUMAN CYP2C9 Cytochrome P450 2C9 (CYP2C9 ) P-450MP P450 PB-1 | S-mephenytoin 4-hydroxylase
Type:
Enzyme
Mol. Mass.:
55636.33
Organism:
Homo sapiens (Human)
Description:
P11712
Residue:
490
  
Inhibitor
Name:
BDBM50197091
Synonyms:
CHEMBL1738980
Type:
Small organic molecule
Emp. Form.:
C17H12ClNO2
Mol. Mass.:
297.736
SMILES:
Cc1nc2ccc(Cl)cc2c(-c2ccccc2)c1C(O)=O
: