Target
Tyrosyl-DNA phosphodiesterase 1
Ligand
BDBM50197097
Substrate
Meas. Tech.
ChEMBL_1619236 (CHEMBL3861405)
IC50
675±n/a nM
Citation
 Khomenko, TZakharenko, AOdarchenko, TArabshahi, HJSannikova, VZakharova, OKorchagina, DReynisson, JVolcho, KSalakhutdinov, NLavrik, O New inhibitors of tyrosyl-DNA phosphodiesterase I (Tdp 1) combining 7-hydroxycoumarin and monoterpenoid moieties. Bioorg Med Chem 24:5573-5581 (2016)  
Target
Name:
Tyrosyl-DNA phosphodiesterase 1
Synonyms:
TDP1 Tyrosyl-DNA phosphodiesterase 1 | Tyrosyl-DNA phosphodiesterase 1 (TDP1)
Type:
Enzyme
Mol. Mass.:
68430.66
Organism:
Homo sapiens (Human)
Description:
Q9NUW8
Residue:
608
  
Inhibitor
Name:
BDBM50197097
Synonyms:
CHEMBL3909527
Type:
Small organic molecule
Emp. Form.:
C22H24O3
Mol. Mass.:
336.4242
SMILES:
[H][C@]12C[C@]([H])(C(COc3ccc4c5CCCc5c(=O)oc4c3)=CC1)C2(C)C
: