Target
Histone deacetylase 2
Ligand
BDBM50197156
Substrate
Meas. Tech.
ChEMBL_1619268 (CHEMBL3861437)
IC50
135±n/a nM
Citation
 Pidugu, VRYarla, NSPedada, SRKalle, AMSatya, AK Design and synthesis of novel HDAC8 inhibitory 2,5-disubstituted-1,3,4-oxadiazoles containing glycine and alanine hybrids with anti cancer activity. Bioorg Med Chem 24:5611-5617 (2016)  
Target
Name:
Histone deacetylase 2
Synonyms:
Cereblon/Histone deacetylase 2 HDAC2 Histone deacetylase 2 (HDAC2) | Human HDAC2
Type:
Chromatin regulator; hydrolase; repressor
Mol. Mass.:
55356.54
Organism:
Homo sapiens (Human)
Description:
Q92769
Residue:
488
  
Inhibitor
Name:
BDBM50197156
Synonyms:
CHEMBL3930237
Type:
Small organic molecule
Emp. Form.:
C12H14N4O2
Mol. Mass.:
246.2652
SMILES:
C[C@@H](N)C(=O)NCc1nnc(o1)-c1ccccc1
: