Target
Fibroblast growth factor receptor 4
Ligand
BDBM50197711
Substrate
Meas. Tech.
ChEMBL_1619704 (CHEMBL3861873)
IC50
110±n/a nM
Citation
 Ebiike, HTaka, NMatsushita, MOhmori, MTakami, KHyohdoh, IKohchi, MHayase, TNishii, HMorikami, KNakanishi, YAkiyama, NShindoh, HIshii, NIsobe, TMatsuoka, H Discovery of [5-Amino-1-(2-methyl-3H-benzimidazol-5-yl)pyrazol-4-yl]-(1H-indol-2-yl)methanone (CH5183284/Debio 1347), An Orally Available and Selective Fibroblast Growth Factor Receptor (FGFR) Inhibitor. J Med Chem 59:10586-10600 (2016)  
Target
Name:
Fibroblast growth factor receptor 4
Synonyms:
CD_antigen: CD334 FGFR4 FGFR4 Fibroblast growth factor receptor JK2 TKF
Type:
Protein
Mol. Mass.:
87957.45
Organism:
Homo sapiens (Human)
Description:
P22455
Residue:
802
  
Inhibitor
Name:
BDBM50197711
Synonyms:
CHEMBL3941474
Type:
Small organic molecule
Emp. Form.:
C20H15N5O
Mol. Mass.:
341.366
SMILES:
Nc1c(cnn1-c1ccc2[nH]ccc2c1)C(=O)c1cc2ccccc2[nH]1
: