Target
Fibroblast growth factor receptor 2
Ligand
BDBM50197686
Substrate
Meas. Tech.
ChEMBL_1619702 (CHEMBL3861871)
IC50
920±n/a nM
Citation
 Ebiike, HTaka, NMatsushita, MOhmori, MTakami, KHyohdoh, IKohchi, MHayase, TNishii, HMorikami, KNakanishi, YAkiyama, NShindoh, HIshii, NIsobe, TMatsuoka, H Discovery of [5-Amino-1-(2-methyl-3H-benzimidazol-5-yl)pyrazol-4-yl]-(1H-indol-2-yl)methanone (CH5183284/Debio 1347), An Orally Available and Selective Fibroblast Growth Factor Receptor (FGFR) Inhibitor. J Med Chem 59:10586-10600 (2016)  
Target
Name:
Fibroblast growth factor receptor 2
Synonyms:
BEK FGFR-2 FGFR2 Fibroblast growth factor receptor 2 (FGFR2) KGFR Keratinocyte growth factor receptor VEGF-receptor 2 and Fibroblast growth factor receptor 2
Type:
Enzyme
Mol. Mass.:
92015.45
Organism:
Homo sapiens (Human)
Description:
P21802
Residue:
821
  
Inhibitor
Name:
BDBM50197686
Synonyms:
CHEMBL3956001
Type:
Small organic molecule
Emp. Form.:
C18H13ClN4O
Mol. Mass.:
336.775
SMILES:
Nc1c(cnn1-c1ccccc1Cl)C(=O)c1cc2ccccc2[nH]1
: