Target
Transthyretin
Ligand
BDBM50197881
Substrate
Meas. Tech.
ChEMBL_1620067 (CHEMBL3862350)
IC50
2490±n/a nM
Citation
 Simões, CJVAlmeida, ZLCosta, DJesus, CSHCardoso, ALAlmeida, MRSaraiva, MJPinho E Melo, TMVDBrito, RMM A novel bis-furan scaffold for transthyretin stabilization and amyloid inhibition. Eur J Med Chem 121:823-840 (2016)  
Target
Name:
Transthyretin
Synonyms:
ATTR Prealbumin TTHY_HUMAN Transthyretin (TTR)
Type:
Enzyme
Mol. Mass.:
15884.31
Organism:
Homo sapiens (Human)
Description:
P02766
Residue:
147
  
Inhibitor
Name:
BDBM50197881
Synonyms:
CHEMBL3890392
Type:
Small organic molecule
Emp. Form.:
C12H9ClO4
Mol. Mass.:
252.65
SMILES:
Cc1oc(\C=C\c2ccc(Cl)o2)cc1C(O)=O
: