Target
Transthyretin
Ligand
BDBM50197885
Substrate
Meas. Tech.
ChEMBL_1620071 (CHEMBL3862354)
Kd
4.8±n/a nM
Citation
 Simões, CJVAlmeida, ZLCosta, DJesus, CSHCardoso, ALAlmeida, MRSaraiva, MJPinho E Melo, TMVDBrito, RMM A novel bis-furan scaffold for transthyretin stabilization and amyloid inhibition. Eur J Med Chem 121:823-840 (2016)  
Target
Name:
Transthyretin
Synonyms:
ATTR Prealbumin TTHY_HUMAN Transthyretin (TTR)
Type:
Enzyme
Mol. Mass.:
15884.31
Organism:
Homo sapiens (Human)
Description:
P02766
Residue:
147
  
Inhibitor
Name:
BDBM50197885
Synonyms:
CHEMBL3940890
Type:
Small organic molecule
Emp. Form.:
C15H17FN2O3
Mol. Mass.:
292.3055
SMILES:
Cc1n[nH]c(C)c1CCCOc1cc(ccc1F)C(O)=O
: