Target
Procathepsin L
Ligand
BDBM50197893
Substrate
Meas. Tech.
ChEMBL_1620102 (CHEMBL3862385)
IC50
17±n/a nM
Citation
 Plebanek, EChevrier, FRoy, VGarenne, TLecaille, FWarszycki, DBojarski, AJLalmanach, GAgrofoglio, LA Straightforward synthesis of 2,4,6-trisubstituted 1,3,5-triazine compounds targeting cysteine cathepsins K and S. Eur J Med Chem 121:12-20 (2016)  
Target
Name:
Procathepsin L
Synonyms:
CATL1_HUMAN CTSL CTSL1 Cathepsin L Cathepsin L1 heavy chain MEP cathepsin L preproprotein
Type:
Enzyme
Mol. Mass.:
37557.19
Organism:
Homo sapiens (Human)
Description:
Purchased from Calbiochem (San Diego, CA).
Residue:
333
  
Inhibitor
Name:
BDBM50197893
Synonyms:
CHEMBL3893204
Type:
Small organic molecule
Emp. Form.:
C14H14N8O2
Mol. Mass.:
326.3134
SMILES:
[O-][N+](=O)c1cccc(Nc2nc(nc(n2)N2CCNCC2)C#N)c1
: