Target
Phosphatidylinositol 5-phosphate 4-kinase type-2 gamma
Ligand
BDBM50198027
Substrate
Meas. Tech.
ChEMBL_1620450 (CHEMBL3862733)
Kd
480±n/a nM
Citation
 Kilchmann, FMarcaida, MJKotak, SSchick, TBoss, SDAwale, MGönczy, PReymond, JL Discovery of a Selective Aurora A Kinase Inhibitor by Virtual Screening. J Med Chem 59:7188-211 (2016)  
Target
Name:
Phosphatidylinositol 5-phosphate 4-kinase type-2 gamma
Synonyms:
PI(5)P 4-kinase type II gamma PIP4K2C PIP5K2C Phosphatidylinositol-5-phosphate 4-kinase type-2 gamma
Type:
PROTEIN
Mol. Mass.:
47302.35
Organism:
Homo sapiens (Human)
Description:
ChEMBL_774614
Residue:
421
  
Inhibitor
Name:
BDBM50198027
Synonyms:
CHEMBL3921246
Type:
Small organic molecule
Emp. Form.:
C24H21N5O3S
Mol. Mass.:
459.52
SMILES:
CCc1ccc(cc1)\N=C1/S\C(=C/c2ccnc(Nc3ccc(cn3)C(O)=O)c2)C(=O)N1C
: