Target
Dipeptidyl peptidase 4
Ligand
BDBM50198187
Substrate
Meas. Tech.
ChEMBL_1620470 (CHEMBL3862753)
IC50
21520±n/a nM
Citation
 Li, SXu, HCui, SWu, FZhang, YSu, MGong, YQiu, SJiao, QQin, CShan, JZhang, MWang, JYin, QXu, MLiu, XWang, RZhu, LLi, JXu, YJiang, HZhao, ZLi, JLi, H Discovery and Rational Design of Natural-Product-Derived 2-Phenyl-3,4-dihydro-2H-benzo[f]chromen-3-amine Analogs as Novel and Potent Dipeptidyl Peptidase 4 (DPP-4) Inhibitors for the Treatment of Type 2 Diabetes. J Med Chem 59:6772-90 (2016)  
Target
Name:
Dipeptidyl peptidase 4
Synonyms:
ADABP Adenosine deaminase complexing protein 2 CD_antigen=CD26 DPP4 DPPIV Dipeptidyl peptidase 4 (DPP IV) Dipeptidyl peptidase 4 (DPP4) Dipeptidyl peptidase 4 membrane form Dipeptidyl peptidase IV Dipeptidyl peptidase IV (DDP-IV) Dipeptidyl peptidase IV membrane form Dipeptidyl peptidase-IV (DPP-4) T-cell activation antigen CD26 | TP103
Type:
Enzyme
Mol. Mass.:
88271.01
Organism:
Homo sapiens (Human)
Description:
P27487
Residue:
766
  
Inhibitor
Name:
BDBM50198187
Synonyms:
CHEMBL3929764
Type:
Small organic molecule
Emp. Form.:
C19H14F3NO3
Mol. Mass.:
361.3146
SMILES:
Cc1cc(=O)oc2c3C[C@@H](N)[C@H](Oc3ccc12)c1cc(F)c(F)cc1F
: