Target
DNA gyrase subunit B
Ligand
BDBM50198235
Substrate
Meas. Tech.
ChEMBL_1620508 (CHEMBL3862791)
IC50
87±n/a nM
Citation
 Gjorgjieva, MToma?ic, TBarancokova, MKatsamakas, SIla?, JTammela, PPeterlin Ma?ic, LKikelj, D Discovery of Benzothiazole Scaffold-Based DNA Gyrase B Inhibitors. J Med Chem 59:8941-8954 (2016)  
Target
Name:
DNA gyrase subunit B
Synonyms:
DNA gyrase subunit B GYRB_ECOLI acrB gyrB hisU parA | pcbA
Type:
Enzyme Subunit
Mol. Mass.:
89941.28
Organism:
Escherichia coli (strain K12)
Description:
P0AES6
Residue:
804
  
Inhibitor
Name:
BDBM50198235
Synonyms:
CHEMBL3931016
Type:
Small organic molecule
Emp. Form.:
C14H8Cl2N4O4S
Mol. Mass.:
399.209
SMILES:
OC(=O)C(=O)Nc1ccc2nc(NC(=O)c3cc(Cl)c(Cl)[nH]3)sc2c1
: