Target
DNA gyrase subunit B
Ligand
BDBM50198322
Substrate
Meas. Tech.
ChEMBL_1620508 (CHEMBL3862791)
IC50
81±n/a nM
Citation
 Gjorgjieva, MToma?ic, TBarancokova, MKatsamakas, SIla?, JTammela, PPeterlin Ma?ic, LKikelj, D Discovery of Benzothiazole Scaffold-Based DNA Gyrase B Inhibitors. J Med Chem 59:8941-8954 (2016)  
Target
Name:
DNA gyrase subunit B
Synonyms:
DNA gyrase subunit B GYRB_ECOLI acrB gyrB hisU parA | pcbA
Type:
Enzyme Subunit
Mol. Mass.:
89941.28
Organism:
Escherichia coli (strain K12)
Description:
P0AES6
Residue:
804
  
Inhibitor
Name:
BDBM50198322
Synonyms:
CHEMBL3936261
Type:
Small organic molecule
Emp. Form.:
C16H12Br2N4O4S
Mol. Mass.:
516.164
SMILES:
CCOC(=O)C(=O)Nc1nc2ccc(NC(=O)c3cc(Br)c(Br)[nH]3)cc2s1
: