Target
Acetyl-CoA carboxylase 2
Ligand
BDBM50198340
Substrate
Meas. Tech.
ChEMBL_1620629 (CHEMBL3862912)
IC50
16±n/a nM
Citation
 Okazaki, SNoguchi-Yachide, TSakai, TIshikawa, MMakishima, MHashimoto, YYamaguchi, T Discovery of N-(1-(3-(4-phenoxyphenyl)-1,2,4-oxadiazol-5-yl)ethyl)acetamides as novel acetyl-CoA carboxylase 2 (ACC2) inhibitors with peroxisome proliferator-activated receptora/d (PPARa/d) dual agonistic activity. Bioorg Med Chem 24:5258-5269 (2016)  
Target
Name:
Acetyl-CoA carboxylase 2
Synonyms:
ACACB ACC-beta ACCB Acetyl-CoA carboxylase 2 Acetyl-CoA carboxylase 2 (ACC2)
Type:
Protein
Mol. Mass.:
276535.21
Organism:
Homo sapiens (Human)
Description:
O00763
Residue:
2458
  
Inhibitor
Name:
BDBM50198340
Synonyms:
CHEMBL3965346
Type:
Small organic molecule
Emp. Form.:
C24H21N3O4
Mol. Mass.:
415.4412
SMILES:
C[C@H](NC(C)=O)c1nc(no1)-c1ccc(Oc2ccc(Oc3ccccc3)cc2)cc1
: