Target
Protein polybromo-1
Ligand
BDBM7459
Substrate
Meas. Tech.
ChEBML_1620730
Kd
12900±n/a nM
Citation
 Myrianthopoulos, VGaboriaud-Kolar, NTallant, CHall, MLGrigoriou, SBrownlee, PMFedorov, ORogers, CHeidenreich, DWanior, MDrosos, NMexia, NSavitsky, PBagratuni, TKastritis, ETerpos, EFilippakopoulos, PMüller, SSkaltsounis, ALDowns, JAKnapp, SMikros, E Discovery and Optimization of a Selective Ligand for the Switch/Sucrose Nonfermenting-Related Bromodomains of Polybromo Protein-1 by the Use of Virtual Screening and Hydration Analysis. J Med Chem 59:8787-8803 (2016)  
Target
Name:
Protein polybromo-1
Synonyms:
BAF180 PB1 PBRM1 hPB1
Type:
PROTEIN
Mol. Mass.:
192953.62
Organism:
Homo sapiens (Human)
Description:
ChEMBL_104264
Residue:
1689
  
Inhibitor
Name:
BDBM7459
Synonyms:
2-(3,4-dihydroxyphenyl)-5,7-dihydroxy-4H-chromen-4-one CHEMBL151 Luteolin (4) cid_5280445 med.21724, Compound 3
Type:
Small organic molecule
Emp. Form.:
C15H10O6
Mol. Mass.:
286.2363
SMILES:
Oc1cc(O)c2c(c1)oc(cc2=O)-c1ccc(O)c(O)c1
: