Target
Microtubule-associated protein tau
Ligand
BDBM50198629
Substrate
Meas. Tech.
ChEBML_1620755
IC50
1200±n/a nM
Citation
 Okuda, MHijikuro, IFujita, YTeruya, TKawakami, HTakahashi, TSugimoto, H Design and synthesis of curcumin derivatives as tau and amyloidß dual aggregation inhibitors. Bioorg Med Chem Lett 26:5024-5028 (2016)  
Target
Name:
Microtubule-associated protein tau
Synonyms:
MAPT MTBT1 Neurofibrillary tangle protein Paired helical filament-tau TAU_HUMAN | Tau Protein
Type:
Protein
Mol. Mass.:
78928.63
Organism:
Homo sapiens (Human)
Description:
P10636
Residue:
758
  
Inhibitor
Name:
BDBM50198629
Synonyms:
CHEMBL3978488
Type:
Small organic molecule
Emp. Form.:
C21H18O6
Mol. Mass.:
366.364
SMILES:
COc1cc(\C=C\C(=O)CC(=O)\C=C\c2ccc3OCOc3c2)ccc1O
: