Target
Mu-type opioid receptor
Ligand
BDBM50198754
Substrate
Meas. Tech.
ChEMBL_1620916 (CHEMBL3863199)
Ki
0.032300±n/a nM
Citation
 Weltrowska, GNguyen, TMChung, NNWood, JMa, XGuo, JWilkes, BCGe, YLaferričre, ACoderre, TJSchiller, PW A Cyclic Tetrapeptide ("Cyclodal") and Its Mirror-Image Isomer Are Both High-Affinityµ Opioid Receptor Antagonists. J Med Chem 59:9243-9254 (2016)  
Target
Name:
Mu-type opioid receptor
Synonyms:
MOR-1 Mu-type opioid receptor (MOR) OPRM_RAT Opioid receptor B Ror-b
Type:
G Protein-Coupled Receptor (GPCR)
Mol. Mass.:
44503.11
Organism:
Rattus norvegicus (rat)
Description:
Competition binding assays were carried out using membrane preparations from transfected HN9.10 cells that constitutively expressed the mu opioid receptor.
Residue:
398
  
Inhibitor
Name:
BDBM50198754
Synonyms:
CHEMBL3924888
Type:
Small organic molecule
Emp. Form.:
C33H48N8O5
Mol. Mass.:
636.7848
SMILES:
Cc1cc(O)cc(C)c1C[C@@H]1NC(=O)[C@H](CCCCN)NC(=O)[C@H](Cc2ccccc2)NC(=O)[C@@H](CCCCNC(N)=N)NC1=O
: