Target
Kappa-type opioid receptor
Ligand
BDBM50198754
Substrate
Meas. Tech.
ChEMBL_1620918 (CHEMBL3863201)
Ki
0.733000±n/a nM
Citation
 Weltrowska, GNguyen, TMChung, NNWood, JMa, XGuo, JWilkes, BCGe, YLaferričre, ACoderre, TJSchiller, PW A Cyclic Tetrapeptide ("Cyclodal") and Its Mirror-Image Isomer Are Both High-Affinityµ Opioid Receptor Antagonists. J Med Chem 59:9243-9254 (2016)  
Target
Name:
Kappa-type opioid receptor
Synonyms:
Kappa Opioid Receptor OPRK1 Opiate Kappa 1 | mu/kappa opioid receptor
Type:
G Protein-Coupled Receptor (GPCR)
Mol. Mass.:
42744.99
Organism:
Cavia porcellus (domestic guinea pig)
Description:
P41144
Residue:
380
  
Inhibitor
Name:
BDBM50198754
Synonyms:
CHEMBL3924888
Type:
Small organic molecule
Emp. Form.:
C33H48N8O5
Mol. Mass.:
636.7848
SMILES:
Cc1cc(O)cc(C)c1C[C@@H]1NC(=O)[C@H](CCCCN)NC(=O)[C@H](Cc2ccccc2)NC(=O)[C@@H](CCCCNC(N)=N)NC1=O
: