Target
CDGSH iron-sulfur domain-containing protein 1
Ligand
BDBM50350488
Substrate
Meas. Tech.
ChEMBL_1620947 (CHEMBL3863230)
IC50
14000±n/a nM
Citation
 Geldenhuys, WJYonutas, HMMorris, DLSullivan, PGDarvesh, ASLeeper, TC Identification of small molecules that bind to the mitochondrial protein mitoNEET. Bioorg Med Chem Lett 26:5350-5353 (2016)  
Target
Name:
CDGSH iron-sulfur domain-containing protein 1
Synonyms:
C10orf70 CISD1_HUMAN ZCD1
Type:
PROTEIN
Mol. Mass.:
12206.48
Organism:
Homo sapiens (Human)
Description:
ChEMBL_766432
Residue:
108
  
Inhibitor
Name:
BDBM50350488
Synonyms:
CHEMBL1061
Type:
Small organic molecule
Emp. Form.:
C10H9NO3S
Mol. Mass.:
223.248
SMILES:
Oc1[nH]c(=O)sc1Cc1ccc(O)cc1
: