Target
CDGSH iron-sulfur domain-containing protein 1
Ligand
BDBM50198891
Substrate
Meas. Tech.
ChEMBL_1620948 (CHEMBL3863231)
Ki
22±n/a nM
Citation
 Geldenhuys, WJYonutas, HMMorris, DLSullivan, PGDarvesh, ASLeeper, TC Identification of small molecules that bind to the mitochondrial protein mitoNEET. Bioorg Med Chem Lett 26:5350-5353 (2016)  
Target
Name:
CDGSH iron-sulfur domain-containing protein 1
Synonyms:
C10orf70 CISD1_HUMAN ZCD1
Type:
PROTEIN
Mol. Mass.:
12206.48
Organism:
Homo sapiens (Human)
Description:
ChEMBL_766432
Residue:
108
  
Inhibitor
Name:
BDBM50198891
Synonyms:
CHEMBL3893332
Type:
Small organic molecule
Emp. Form.:
C19H17NO3S2
Mol. Mass.:
371.473
SMILES:
COc1cc(\C=C2\SC(=S)NC2=O)ccc1OCc1ccc(C)cc1
: