Target
D(4) dopamine receptor
Ligand
BDBM50199139
Substrate
Meas. Tech.
ChEMBL_1621375 (CHEMBL3863658)
Ki
37±n/a nM
Citation
 Ofori, EZhu, XYEtukala, JRBricker, BAAblordeppey, SY Synthesis and evaluation of the structural elements in alkylated tetrahydroisoquinolines for binding to CNS receptors. Bioorg Med Chem 24:5730-5740 (2016)  
Target
Name:
D(4) dopamine receptor
Synonyms:
D(4) dopamine receptor DOPAMINE D4.4 Dopamine receptor | Drd4
Type:
Enzyme Catalytic Domain
Mol. Mass.:
41307.65
Organism:
RAT
Description:
DOPAMINE D4.4 0 RAT::P30729
Residue:
387
  
Inhibitor
Name:
BDBM50199139
Synonyms:
CHEMBL3941795
Type:
Small organic molecule
Emp. Form.:
C20H28Cl2N2S
Mol. Mass.:
399.421
SMILES:
Cl.Clc1ccc2sc(CCCCN3CCC4CCCCC4C3)nc2c1
: