Target
5-hydroxytryptamine receptor 7
Ligand
BDBM50199136
Substrate
Meas. Tech.
ChEMBL_1621378 (CHEMBL3863661)
Ki
25±n/a nM
Citation
 Ofori, EZhu, XYEtukala, JRBricker, BAAblordeppey, SY Synthesis and evaluation of the structural elements in alkylated tetrahydroisoquinolines for binding to CNS receptors. Bioorg Med Chem 24:5730-5740 (2016)  
Target
Name:
5-hydroxytryptamine receptor 7
Synonyms:
5-HT-7 5-HT7 5-HT7S 5HT7 HTR7 | Serotonin receptor 7
Type:
G Protein-Coupled Receptor (GPCR)
Mol. Mass.:
53573.08
Organism:
Homo sapiens (Human)
Description:
P34969
Residue:
479
  
Inhibitor
Name:
BDBM50199136
Synonyms:
CHEMBL3970299
Type:
Small organic molecule
Emp. Form.:
C20H22Cl2N2S
Mol. Mass.:
393.373
SMILES:
Cl.Clc1ccc2sc(CCCCN3CCc4ccccc4C3)nc2c1
: