Target
Integrin alpha-V/beta-1
Ligand
BDBM50199343
Substrate
Meas. Tech.
ChEMBL_1621498 (CHEMBL3863781)
IC50
13±n/a nM
Citation
 Reed, NITang, YZMcIntosh, JWu, YMolnar, KSCivitavecchia, ASheppard, DDeGrado, WFJo, H Exploring ACS Med Chem Lett 7:902-907 (2016)  
Target
Name:
Integrin alpha-V/beta-1
Synonyms:
Fibronectin receptor beta/Vitronectin receptor alpha Integrin alpha-V/beta-1
Type:
Enzyme
Mol. Mass.:
Description:
Components:
This complex has 2 components.
Component 1
Name:
Integrin alpha-V
Synonyms:
ITAV_HUMAN Integrin alpha-V/alpha-5 VNRA Vitronectin receptor | Vitronectin receptor subunit alpha
Type:
PROTEIN
Mol. Mass.:
116024.92
Organism:
Homo sapiens (Human)
Description:
ChEMBL_582336
Residue:
1048
  
Component 2
Name:
Integrin beta-1
Synonyms:
CD_antigen=CD29 Fibronectin receptor beta GPIIA ITGB1 MDF2 | MSK12
Type:
Enzyme
Mol. Mass.:
88400.38
Organism:
Homo sapiens (Human)
Description:
P05556
Residue:
798
  
Inhibitor
Name:
BDBM50199343
Synonyms:
CHEMBL3957812
Type:
Small organic molecule
Emp. Form.:
C26H33N7O8S
Mol. Mass.:
603.647
SMILES:
NC(=N)NCCCCC(=O)Nc1ccc(C[C@H](NC(=O)[C@@H]2CCCN2S(=O)(=O)c2cccc(c2)[N+]([O-])=O)C(O)=O)cc1
: