Target
Integrin alpha-5/beta-1
Ligand
BDBM50199345
Substrate
Meas. Tech.
ChEMBL_1621502 (CHEMBL3863785)
IC50
63±n/a nM
Citation
 Reed, NITang, YZMcIntosh, JWu, YMolnar, KSCivitavecchia, ASheppard, DDeGrado, WFJo, H Exploring ACS Med Chem Lett 7:902-907 (2016)  
Target
Name:
Integrin alpha-5/beta-1
Synonyms:
Fibronectin receptor alpha/beta ITGA5/ITGB1
Type:
Enzyme
Mol. Mass.:
Description:
Components:
This complex has 2 components.
Component 1
Name:
Integrin alpha-5
Synonyms:
CD49 antigen-like family member E FNRA Fibronectin receptor subunit alpha ITGA5 Integrin alpha-F | VLA-5
Type:
Single-pass type I membrane protein
Mol. Mass.:
114523.00
Organism:
Homo sapiens (Human)
Description:
Residue:
1049
  
Component 2
Name:
Integrin beta-1
Synonyms:
CD_antigen=CD29 Fibronectin receptor beta GPIIA ITGB1 MDF2 | MSK12
Type:
Enzyme
Mol. Mass.:
88400.38
Organism:
Homo sapiens (Human)
Description:
P05556
Residue:
798
  
Inhibitor
Name:
BDBM50199345
Synonyms:
CHEMBL3893700 | US10131658, Compound 201
Type:
Small organic molecule
Emp. Form.:
C28H30N6O6S
Mol. Mass.:
578.639
SMILES:
NC(=N)Nc1cccc(c1)C(=O)Nc1ccc(C[C@H](NC(=O)[C@@H]2CCCN2S(=O)(=O)c2ccccc2)C(O)=O)cc1
: