Target
cAMP-specific 3',5'-cyclic phosphodiesterase 4B
Ligand
BDBM50199714
Substrate
Meas. Tech.
ChEMBL_1621667 (CHEMBL3863950)
IC50
9.2±n/a nM
Citation
 Grŕcia, JBuil, MACastro, JEichhorn, PFerrer, MGavaldŕ, AHernández, BSegarra, VLehner, MDMoreno, IPagčs, LRoberts, RSSerrat, JSevilla, STaltavull, JAndrés, MCabedo, JVilella, DCalama, ECarcasona, CMiralpeix, M Biphenyl Pyridazinone Derivatives as Inhaled PDE4 Inhibitors: Structural Biology and Structure-Activity Relationships. J Med Chem 59:10479-10497 (2016)  
Target
Name:
cAMP-specific 3',5'-cyclic phosphodiesterase 4B
Synonyms:
3',5'-cyclic phosphodiesterase Isoform PDE4B1 PDE4B PDE4B_HUMAN Phosphodiesterase 4B (PDE4B) Phosphodiesterase Type 4 (PDE4B)
Type:
Protein
Mol. Mass.:
83318.87
Organism:
Homo sapiens (Human)
Description:
Q07343
Residue:
736
  
Inhibitor
Name:
BDBM50199714
Synonyms:
CHEMBL3922564
Type:
Small organic molecule
Emp. Form.:
C21H19N3O4
Mol. Mass.:
377.3933
SMILES:
CCn1nc(-c2ccccc2)c(C(C)=O)c(Nc2ccc(cc2)C(O)=O)c1=O
: