Target
Sodium-dependent dopamine transporter
Ligand
BDBM50199790
Substrate
Meas. Tech.
ChEMBL_1621702 (CHEMBL3863985)
Ki
17±n/a nM
Citation
 Cao, JSlack, RDBakare, OMBurzynski, CRais, RSlusher, BSKopajtic, TBonifazi, AEllenberger, MPYano, HHe, YBi, GHXi, ZXLoland, CJNewman, AH Novel and High Affinity 2-[(Diphenylmethyl)sulfinyl]acetamide (Modafinil) Analogues as Atypical Dopamine Transporter Inhibitors. J Med Chem 59:10676-10691 (2016)  
Target
Name:
Sodium-dependent dopamine transporter
Synonyms:
DA transporter SC6A3_RAT Sodium-dependent dopamine transporter | Sodium-dependent dopamine transporter (DAT)
Type:
Multi-pass membrane protein
Mol. Mass.:
68749.45
Organism:
Rattus norvegicus (rat)
Description:
P23977
Residue:
619
  
Inhibitor
Name:
BDBM50199790
Synonyms:
CHEMBL3916231 US11555013, Compound 9d | US9862679, Compound 9d
Type:
Small organic molecule
Emp. Form.:
C22H28F2N2OS
Mol. Mass.:
406.532
SMILES:
CC(O)CN1CCN(CCSC(c2ccc(F)cc2)c2ccc(F)cc2)CC1
: