Target
Sodium-dependent dopamine transporter
Ligand
BDBM50199795
Substrate
Meas. Tech.
ChEMBL_1621702 (CHEMBL3863985)
Ki
6.7±n/a nM
Citation
 Cao, JSlack, RDBakare, OMBurzynski, CRais, RSlusher, BSKopajtic, TBonifazi, AEllenberger, MPYano, HHe, YBi, GHXi, ZXLoland, CJNewman, AH Novel and High Affinity 2-[(Diphenylmethyl)sulfinyl]acetamide (Modafinil) Analogues as Atypical Dopamine Transporter Inhibitors. J Med Chem 59:10676-10691 (2016)  
Target
Name:
Sodium-dependent dopamine transporter
Synonyms:
DA transporter SC6A3_RAT Sodium-dependent dopamine transporter | Sodium-dependent dopamine transporter (DAT)
Type:
Multi-pass membrane protein
Mol. Mass.:
68749.45
Organism:
Rattus norvegicus (rat)
Description:
P23977
Residue:
619
  
Inhibitor
Name:
BDBM50199795
Synonyms:
CHEMBL3909363 US11555013, Compound 9j | US9862679, Compound 9j
Type:
Small organic molecule
Emp. Form.:
C28H32F2N2OS
Mol. Mass.:
482.628
SMILES:
OC(CN1CCN(CCSC(c2ccc(F)cc2)c2ccc(F)cc2)CC1)Cc1ccccc1
: