Target
Androgen receptor
Ligand
BDBM50199857
Substrate
Meas. Tech.
ChEMBL_1621743 (CHEMBL3864026)
IC50
467±n/a nM
Citation
 He, YWu, MLiu, YLi, QLi, XHu, LCen, SZhou, J Identification of Triptophenolide from ACS Med Chem Lett 7:1024-1027 (2016)  
Target
Name:
Androgen receptor
Synonyms:
ANDR_RAT Ar Nr3c4 | androgen
Type:
Enzyme
Mol. Mass.:
98219.08
Organism:
Rattus norvegicus (Rat)
Description:
P15207
Residue:
902
  
Inhibitor
Name:
BDBM50199857
Synonyms:
TRIPTOPHENOLIDE
Type:
Small organic molecule
Emp. Form.:
C20H24O3
Mol. Mass.:
312.4028
SMILES:
[H][C@@]12CCc3c(O)c(ccc3[C@@]1(C)CCC1=C2COC1=O)C(C)C
: