Target
Tyrosine-protein kinase JAK3
Ligand
BDBM50199879
Substrate
Meas. Tech.
ChEMBL_1621770 (CHEMBL3864053)
IC50
68±n/a nM
Citation
 Ge, YJin, YWang, CZhang, JTang, ZPeng, JLiu, KLi, YZhou, YMa, X Discovery of Novel Bruton's Tyrosine Kinase (BTK) Inhibitors Bearing a ACS Med Chem Lett 7:1050-1055 (2016)  
Target
Name:
Tyrosine-protein kinase JAK3
Synonyms:
JAK-3 JAK3_HUMAN Janus kinase 3 (JAK3) L-JAK | Leukocyte janus kinase
Type:
Protein
Mol. Mass.:
125111.08
Organism:
Homo sapiens (Human)
Description:
P52333
Residue:
1124
  
Inhibitor
Name:
BDBM50199879
Synonyms:
CHEMBL3966494
Type:
Small organic molecule
Emp. Form.:
C26H28N8O
Mol. Mass.:
468.5535
SMILES:
CCN1CCN(CC1)c1ccc(Nc2ncc3ncn(-c4cccc(NC(=O)C=C)c4)c3n2)cc1
: